{"text_format":"1","workbook":"xlsx","n_sheets":4,"sheets":["Leia-me","Entrada de Dados","Comparativo Acumulado Geral","Cadastros"],"not_rendered":{"charts":0,"images":3,"macros":1,"external_links":0,"defined_names":39,"comments":1,"pivot_tables":0},"unopened":[],"bounds":{"document_bytes":16777216,"sheet_cells":100000,"rows_first":2000,"rows_last":500,"rows_between":2000,"halvings":0,"cell_chars":16384,"cell_head_chars":4096},"cells_cut":0,"cells_raw":0,"read":"whole","date_system":"1900"}

{"sheet":"Leia-me","index":0,"n_rows":87,"n_cols":6,"rows_kept":87,"cut":false,"hidden":false,"merged":[[82,2,82,5],[1,5,2,15],[5,1,7,14],[9,1,11,14],[58,2,59,14],[80,2,80,5]]}
[]
[null,null,null,null,null,"P L A N I L H A    D E    O R Ç A M E N T O    E M P R E S A R I A L"]
[]
[]
[]
[null,"Esta planilha foi feita para simplificar a vida dos profissionais de planejamento, este modelo utiliza valores fechados (inseridos), mas pode ser complementada com bancos de dados analíticos que a alimentarão, como por exemplo planilhas de contas a pagar e a receber."]
[]
[]
[]
[null,"Desta forma você saberá onde gasta, onde ganha e quem são os responsáveis por esses gastos e receitas. Permitindo que você faça cortes de gastos onde realmente devem ser feitos, assim como, verificar quais produtos e serviços são mais rentáves, e quais não são. "]
[]
[]
[]
[null,"Para utilizá-la siga o roteiro abaixo, as contas existentes podem ser apagadas, são apenas exemplos:"]
[]
[null,null,"1º","Na planilha de Cadastros crie:"]
[null,null,null,null,"1º-a","Os Centros de Custos que poderão ser numéricos, alfabéticos ou alfanuméricos"]
[null,null,null,null,"1º-b","Crie os grupos de contas de despesas e de receitas"]
[null,null,null,null,"1º-c","Em contas, Selecione o grupo a que vai vincular uma determinada conta."]
[null,null,null,null,"1º-d","Crie a conta propriamente dita, no máximo 50 contas por grupo. Se necessitar de mais contas solicite"]
{"$rows_left_out":68}
{"sheet":"Entrada de Dados","index":1,"n_rows":1509,"n_cols":14,"rows_kept":1509,"cut":false,"hidden":false,"merged":[[0,2,1,6],[4,7,4,8],[2,2,2,6]]}
[null,null,"B A N C O    D E    D A D O S    O R Ç A M E N T Á R I O"]
[]
[null,null,"Previsto e Realizado"]
[null,null,2011]
[null,null,null,null,null,null,null,"Valores"]
[null,"Mês","Centro de Custos","Flag2","Grupo","Flag","Conta"," Previsto","Realizado","% Realizado","Observação",null,null,"Calendário"]
[null,"2011-01-01","Finanças",{"$f":"HLOOKUP(E7,Cadastros!$U$5:$AX$7,3,FALSE)","v":11},"03 Treinamentos",{"$f":"HLOOKUP(E7,Cadastros!$U$5:$AX$7,3,FALSE)","v":11},"Informática",4000,3500,{"$f":"IF(I7=\"\",\"\",I7/H7)","v":0.875},null,null,null,{"$f":"DATE(ano,1,1)","v":"2011-01-01"}]
[null,"2011-01-01","Produção",{"$f":"HLOOKUP(E8,Cadastros!$U$5:$AX$7,3,FALSE)","v":7},"03 Custos",{"$f":"HLOOKUP(E8,Cadastros!$U$5:$AX$7,3,FALSE)","v":7},"Mão de Obra",2500,2500,1,null,null,null,{"$f":"DATE(ano,2,1)","v":"2011-02-01"}]
[null,"2011-01-01","Receitas Operacionais",{"$f":"HLOOKUP(E9,Cadastros!$U$5:$AX$7,3,FALSE)","v":4},"02 Vendas",{"$f":"HLOOKUP(E9,Cadastros!$U$5:$AX$7,3,FALSE)","v":4},"Produto \"A\"",25000,24500,0.98,null,null,null,{"$f":"DATE(ano,3,1)","v":"2011-03-01"}]
[null,"2011-01-01","Recursos Humanos",{"$f":"HLOOKUP(E10,Cadastros!$U$5:$AX$7,3,FALSE)","v":5},"03 Administrativas",{"$f":"HLOOKUP(E10,Cadastros!$U$5:$AX$7,3,FALSE)","v":5},"Matl. De Escritório",100,58,0.57999999999999996,null,null,null,{"$f":"DATE(ano,4,1)","v":"2011-04-01"}]
[null,"2011-01-01","Recursos Humanos",{"$f":"HLOOKUP(E11,Cadastros!$U$5:$AX$7,3,FALSE)","v":5},"03 Administrativas",{"$f":"HLOOKUP(E11,Cadastros!$U$5:$AX$7,3,FALSE)","v":5},"Matl. De Escritório",1200,1500,1.25,null,null,null,{"$f":"DATE(ano,5,1)","v":"2011-05-01"}]
[null,"2011-01-01","Serviços Gerais (mass alocation)",{"$f":"HLOOKUP(E12,Cadastros!$U$5:$AX$7,3,FALSE)","v":10},"03 Infraestrutura",{"$f":"HLOOKUP(E12,Cadastros!$U$5:$AX$7,3,FALSE)","v":10},"Água e Esgoto",450,425,0.94444444444444442,null,null,null,{"$f":"DATE(ano,6,1)","v":"2011-06-01"}]
[null,"2011-01-01","Serviços Gerais (mass alocation)",{"$f":"HLOOKUP(E13,Cadastros!$U$5:$AX$7,3,FALSE)","v":10},"03 Infraestrutura",{"$f":"HLOOKUP(E13,Cadastros!$U$5:$AX$7,3,FALSE)","v":10},"Energia Elétrica",650,720,1.1076923076923078,null,null,null,{"$f":"DATE(ano,7,1)","v":"2011-07-01"}]
[null,"2011-01-01","Serviços Gerais (mass alocation)",{"$f":"HLOOKUP(E14,Cadastros!$U$5:$AX$7,3,FALSE)","v":10},"03 Infraestrutura",{"$f":"HLOOKUP(E14,Cadastros!$U$5:$AX$7,3,FALSE)","v":10},"Manutenção Predial",350,120,0.34285714285714286,null,null,null,{"$f":"DATE(ano,8,1)","v":"2011-08-01"}]
[null,"2011-02-01","Finanças",{"$f":"HLOOKUP(E15,Cadastros!$U$5:$AX$7,3,FALSE)","v":5},"03 Administrativas",{"$f":"HLOOKUP(E15,Cadastros!$U$5:$AX$7,3,FALSE)","v":5},"Matl. De Escritório",500,900,1.8,null,null,null,{"$f":"DATE(ano,9,1)","v":"2011-09-01"}]
[null,"2011-02-01","Finanças",{"$f":"HLOOKUP(E16,Cadastros!$U$5:$AX$7,3,FALSE)","v":11},"03 Treinamentos",{"$f":"HLOOKUP(E16,Cadastros!$U$5:$AX$7,3,FALSE)","v":11},"Inglês in company",1500,1500,1,null,null,null,{"$f":"DATE(ano,10,1)","v":"2011-10-01"}]
[null,"2011-02-01","Presidência",{"$f":"HLOOKUP(E17,Cadastros!$U$5:$AX$7,3,FALSE)","v":6},"03 Comunicações",{"$f":"HLOOKUP(E17,Cadastros!$U$5:$AX$7,3,FALSE)","v":6},"Internet",500,450,0.9,null,null,null,{"$f":"DATE(ano,11,1)","v":"2011-11-01"}]
[null,"2011-02-01","Receitas Operacionais",{"$f":"HLOOKUP(E18,Cadastros!$U$5:$AX$7,3,FALSE)","v":4},"02 Vendas",{"$f":"HLOOKUP(E18,Cadastros!$U$5:$AX$7,3,FALSE)","v":4},"Produto \"A\"",50000,4500,0.09,null,null,null,{"$f":"DATE(ano,12,1)","v":"2011-12-01"}]
[null,"2011-02-01","Recursos Humanos",{"$f":"HLOOKUP(E19,Cadastros!$U$5:$AX$7,3,FALSE)","v":5},"03 Administrativas",{"$f":"HLOOKUP(E19,Cadastros!$U$5:$AX$7,3,FALSE)","v":5},"Salários",1200,1000,0.83333333333333337]
[null,"2011-02-01","Serviços Gerais (mass alocation)",{"$f":"HLOOKUP(E20,Cadastros!$U$5:$AX$7,3,FALSE)","v":10},"03 Infraestrutura",{"$f":"HLOOKUP(E20,Cadastros!$U$5:$AX$7,3,FALSE)","v":10},"Água e Esgoto",450,430,0.9555555555555556]
{"$rows_left_out":1490}
{"sheet":"Comparativo Acumulado Geral","index":2,"n_rows":104,"n_cols":12,"rows_kept":104,"cut":false,"hidden":false,"merged":[[0,0,12,0],[1,5,1,11],[2,5,2,11],[5,6,6,7],[10,2,10,6],[4,2,7,2],[4,8,7,9],[5,10,6,10]]}
["www.geraldcorelli.com"]
[null,null,null,null,null,"R E L A T Ó R I O    C O M P A R A T I V O    C O M    A    R E C E I T A "]
[null,null,null,null,null,{"$f":"\"SOBRE O REALIZADO ACUMULADO ATÉ \"&UPPER(TEXT(K6,\"MMMM\"))","v":"SOBRE O REALIZADO ACUMULADO ATÉ MAIO"}]
[]
[null,null,"Escolha o Centro de Custos que                                                              representa as Receitas Operacionais:",null,null,null,null,null,"Acumular até \no mês de:"]
[null,null,null,null,null,null,"Receitas Operacionais",null,null,null,"2011-05-01"]
[]
[]
[]
[null,null,"Grupo","Flag1","Flag2",null,null,"Valor",null,"%"]
[null,null,{"$f":"G6&\" acumuladas até \"&TEXT(K6,\"mmmm\")","v":"Receitas Operacionais acumuladas até maio"},null,null,null,null,{"$f":"SUMPRODUCT(('Entrada de Dados'!$B$7:$B$1508<=$K$6)*('Entrada de Dados'!$C$7:$C$1508=$G$6)*('Entrada de Dados'!$I$7:$I$1508))","v":36500},null,{"$f":"H11/$H$11","v":1}]
[]
[null,null,"Grupo","Flag1","Flag2","Conta","Previsto","Realizado","P x R","% s/ Rec.","Total do Grupo","% s/ Rec."]
[{"$f":"IF(H14=\"\",\"\",ROW())","v":14},1,{"$f":"HLOOKUP(B14,Cadastros!$U$4:$AX$5,2,TRUE)","v":"01 Imobilizado"},{"$f":"HLOOKUP(C14,Cadastros!$U$5:$AX$7,3,FALSE)","v":1},{"$f":"COUNTA($D$14:D14)","v":1},{"$f":"HLOOKUP(D14,OFFSET(INDIRECT(\"Cadastros!$U$\"&7,TRUE),,,52,1),E14+1,FALSE)","v":"Máquinas e Equipamentos"},{"$f":"IF(F14=\"\",\"\",SUMPRODUCT(('Entrada de Dados'!$B$7:$B$1508<=$K$6)*('Entrada de Dados'!$G$7:$G$1508=F14)*('Entrada de Dados'!$H$7:$H$1508)))","v":0},{"$f":"IF(F14=\"\",\"\",SUMPRODUCT(('Entrada de Dados'!$B$7:$B$1508<=$K$6)*('Entrada de Dados'!$G$7:$G$1508=F14)*('Entrada de Dados'!$I$7:$I$1508)))","v":0},{"$f":"IF(H14=\"\",\"\",IF(H14=0,0,H14/G14))","v":0},{"$f":"IF(H14=\"\",\"\",H14/$H$11)","v":0},{"$f":"IF(F14=\"\",\"\",IF(F15<>\"\",\"\",SUMPRODUCT(--($D$14:$D$104=D14),($H$14:$H$104))))","v":0},{"$f":"IF(K14=\"\",\"\",K14/$H$11)","v":0}]
[{"$f":"IF(H15=\"\",\"\",ROW())","v":""},{"$f":"IF(MAX($B$14:B14)=MAX(Cadastros!$U$4:$AQ$4),\"\",IF(D14=\"\",MAX($B$14:B14)+1,IF(E14=HLOOKUP(D14,Cadastros!$U$4:$AQ$6,3,TRUE),\"\",\"\")))","v":""},{"$f":"IF(B15=\"\",\"\",HLOOKUP(B15,Cadastros!$U$4:$AX$5,2,TRUE))","v":""},{"$f":"IF(D14=\"\",B15,IF(E14>=HLOOKUP(D14,Cadastros!$U$4:$AQ$6,3,TRUE),\"\",IF(C15=\"\",D14,HLOOKUP(C15,Cadastros!$U$5:$AX$7,2,FALSE))))","v":""},{"$f":"IF(D15=\"\",\"\",COUNTIF($D$14:D15,D15))","v":""},{"$f":"IF(D15=\"\",\"\",HLOOKUP(D15,OFFSET(INDIRECT(\"Cadastros!$U$\"&7,TRUE),,,52,D15),E15+1,FALSE))","v":""},{"$f":"IF(F15=\"\",\"\",SUMPRODUCT(('Entrada de Dados'!$B$7:$B$1508<=$K$6)*('Entrada de Dados'!$G$7:$G$1508=F15)*('Entrada de Dados'!$H$7:$H$1508)))","v":""},{"$f":"IF(F15=\"\",\"\",SUMPRODUCT(('Entrada de Dados'!$B$7:$B$1508<=$K$6)*('Entrada de Dados'!$G$7:$G$1508=F15)*('Entrada de Dados'!$I$7:$I$1508)))","v":""},"",{"$f":"IF(H15=\"\",\"\",H15/$H$11)","v":""},{"$f":"IF(F15=\"\",\"\",IF(F16<>\"\",\"\",SUMPRODUCT(--($D$14:$D$104=D15),($H$14:$H$104))))","v":""},{"$f":"IF(K15=\"\",\"\",K15/$H$11)","v":""}]
["",{"$f":"IF(MAX($B$14:B15)=MAX(Cadastros!$U$4:$AQ$4),\"\",IF(D15=\"\",MAX($B$14:B15)+1,IF(E15=HLOOKUP(D15,Cadastros!$U$4:$AQ$6,3,TRUE),\"\",\"\")))","v":2},{"$f":"IF(B16=\"\",\"\",HLOOKUP(B16,Cadastros!$U$4:$AX$5,2,TRUE))","v":"01 Investimentos"},{"$f":"IF(D15=\"\",B16,IF(E15>=HLOOKUP(D15,Cadastros!$U$4:$AQ$6,3,TRUE),\"\",IF(C16=\"\",D15,HLOOKUP(C16,Cadastros!$U$5:$AX$7,2,FALSE))))","v":2},{"$f":"IF(D16=\"\",\"\",COUNTIF($D$14:D16,D16))","v":1},"",{"$f":"IF(F16=\"\",\"\",SUMPRODUCT(('Entrada de Dados'!$B$7:$B$1508<=$K$6)*('Entrada de Dados'!$G$7:$G$1508=F16)*('Entrada de Dados'!$H$7:$H$1508)))","v":""},{"$f":"IF(F16=\"\",\"\",SUMPRODUCT(('Entrada de Dados'!$B$7:$B$1508<=$K$6)*('Entrada de Dados'!$G$7:$G$1508=F16)*('Entrada de Dados'!$I$7:$I$1508)))","v":""},"",{"$f":"IF(H16=\"\",\"\",H16/$H$11)","v":""},"",{"$f":"IF(K16=\"\",\"\",K16/$H$11)","v":""}]
["",{"$f":"IF(MAX($B$14:B16)=MAX(Cadastros!$U$4:$AQ$4),\"\",IF(D16=\"\",MAX($B$14:B16)+1,IF(E16=HLOOKUP(D16,Cadastros!$U$4:$AQ$6,3,TRUE),\"\",\"\")))","v":""},{"$f":"IF(B17=\"\",\"\",HLOOKUP(B17,Cadastros!$U$4:$AX$5,2,TRUE))","v":""},{"$f":"IF(D16=\"\",B17,IF(E16>=HLOOKUP(D16,Cadastros!$U$4:$AQ$6,3,TRUE),\"\",IF(C17=\"\",D16,HLOOKUP(C17,Cadastros!$U$5:$AX$7,2,FALSE))))","v":""},{"$f":"IF(D17=\"\",\"\",COUNTIF($D$14:D17,D17))","v":""},{"$f":"IF(D17=\"\",\"\",HLOOKUP(D17,OFFSET(INDIRECT(\"Cadastros!$U$\"&7,TRUE),,,52,D17),E17+1,FALSE))","v":""},{"$f":"IF(F17=\"\",\"\",SUMPRODUCT(('Entrada de Dados'!$B$7:$B$1508<=$K$6)*('Entrada de Dados'!$G$7:$G$1508=F17)*('Entrada de Dados'!$H$7:$H$1508)))","v":""},{"$f":"IF(F17=\"\",\"\",SUMPRODUCT(('Entrada de Dados'!$B$7:$B$1508<=$K$6)*('Entrada de Dados'!$G$7:$G$1508=F17)*('Entrada de Dados'!$I$7:$I$1508)))","v":""},{"$f":"IF(H17=\"\",\"\",IF(H17=0,0,H17/G17))","v":""},"","",""]
[18,{"$f":"IF(MAX($B$14:B17)=MAX(Cadastros!$U$4:$AQ$4),\"\",IF(D17=\"\",MAX($B$14:B17)+1,IF(E17=HLOOKUP(D17,Cadastros!$U$4:$AQ$6,3,TRUE),\"\",\"\")))","v":3},{"$f":"IF(B18=\"\",\"\",HLOOKUP(B18,Cadastros!$U$4:$AX$5,2,TRUE))","v":"02 Serviços"},{"$f":"IF(D17=\"\",B18,IF(E17>=HLOOKUP(D17,Cadastros!$U$4:$AQ$6,3,TRUE),\"\",IF(C18=\"\",D17,HLOOKUP(C18,Cadastros!$U$5:$AX$7,2,FALSE))))","v":3},{"$f":"IF(D18=\"\",\"\",COUNTIF($D$14:D18,D18))","v":1},{"$f":"IF(D18=\"\",\"\",HLOOKUP(D18,OFFSET(INDIRECT(\"Cadastros!$U$\"&7,TRUE),,,52,D18),E18+1,FALSE))","v":"Consultoria"},{"$f":"IF(F18=\"\",\"\",SUMPRODUCT(('Entrada de Dados'!$B$7:$B$1508<=$K$6)*('Entrada de Dados'!$G$7:$G$1508=F18)*('Entrada de Dados'!$H$7:$H$1508)))","v":0},{"$f":"IF(F18=\"\",\"\",SUMPRODUCT(('Entrada de Dados'!$B$7:$B$1508<=$K$6)*('Entrada de Dados'!$G$7:$G$1508=F18)*('Entrada de Dados'!$I$7:$I$1508)))","v":0},{"$f":"IF(H18=\"\",\"\",IF(H18=0,0,H18/G18))","v":0},{"$f":"IF(H18=\"\",\"\",H18/$H$11)","v":0},"",{"$f":"IF(K18=\"\",\"\",K18/$H$11)","v":""}]
[19,{"$f":"IF(MAX($B$14:B18)=MAX(Cadastros!$U$4:$AQ$4),\"\",IF(D18=\"\",MAX($B$14:B18)+1,IF(E18=HLOOKUP(D18,Cadastros!$U$4:$AQ$6,3,TRUE),\"\",\"\")))","v":""},{"$f":"IF(B19=\"\",\"\",HLOOKUP(B19,Cadastros!$U$4:$AX$5,2,TRUE))","v":""},{"$f":"IF(D18=\"\",B19,IF(E18>=HLOOKUP(D18,Cadastros!$U$4:$AQ$6,3,TRUE),\"\",IF(C19=\"\",D18,HLOOKUP(C19,Cadastros!$U$5:$AX$7,2,FALSE))))","v":3},{"$f":"IF(D19=\"\",\"\",COUNTIF($D$14:D19,D19))","v":2},"Manutenção",{"$f":"IF(F19=\"\",\"\",SUMPRODUCT(('Entrada de Dados'!$B$7:$B$1508<=$K$6)*('Entrada de Dados'!$G$7:$G$1508=F19)*('Entrada de Dados'!$H$7:$H$1508)))","v":0},{"$f":"IF(F19=\"\",\"\",SUMPRODUCT(('Entrada de Dados'!$B$7:$B$1508<=$K$6)*('Entrada de Dados'!$G$7:$G$1508=F19)*('Entrada de Dados'!$I$7:$I$1508)))","v":0},0,0,"",""]
[20,{"$f":"IF(MAX($B$14:B19)=MAX(Cadastros!$U$4:$AQ$4),\"\",IF(D19=\"\",MAX($B$14:B19)+1,IF(E19=HLOOKUP(D19,Cadastros!$U$4:$AQ$6,3,TRUE),\"\",\"\")))","v":""},{"$f":"IF(B20=\"\",\"\",HLOOKUP(B20,Cadastros!$U$4:$AX$5,2,TRUE))","v":""},{"$f":"IF(D19=\"\",B20,IF(E19>=HLOOKUP(D19,Cadastros!$U$4:$AQ$6,3,TRUE),\"\",IF(C20=\"\",D19,HLOOKUP(C20,Cadastros!$U$5:$AX$7,2,FALSE))))","v":3},{"$f":"IF(D20=\"\",\"\",COUNTIF($D$14:D20,D20))","v":3},"Operacionais",{"$f":"IF(F20=\"\",\"\",SUMPRODUCT(('Entrada de Dados'!$B$7:$B$1508<=$K$6)*('Entrada de Dados'!$G$7:$G$1508=F20)*('Entrada de Dados'!$H$7:$H$1508)))","v":0},{"$f":"IF(F20=\"\",\"\",SUMPRODUCT(('Entrada de Dados'!$B$7:$B$1508<=$K$6)*('Entrada de Dados'!$G$7:$G$1508=F20)*('Entrada de Dados'!$I$7:$I$1508)))","v":0},0,0,0,0]
{"$rows_left_out":85}
{"sheet":"Cadastros","index":3,"n_rows":1009,"n_cols":50,"rows_kept":1009,"cut":false,"hidden":false,"merged":[[4,1,4,3],[2,9,3,17],[0,4,3,7]]}
[null,null,null,null,"C A D A S T R O S"]
[]
[null,null,null,null,null,null,null,null,null," Escolha primeiro o grupo à que a conta estará vinculada.                                                                                                                       *Máximo de 50 contas por grupo."]
[null,null,null,null,null,null,null,null,null,null,null,null,null,null,null,null,null,null,null,null,{"$f":"IF(OR(U5=0,U6=0),\"\",1)","v":1},{"$f":"IF(V5=0,\"\",MAX($U$4:U4)+1)","v":2},{"$f":"IF(W5=0,\"\",MAX($U$4:V4)+1)","v":3},{"$f":"IF(X5=0,\"\",MAX($U$4:W4)+1)","v":4},{"$f":"IF(Y5=0,\"\",MAX($U$4:X4)+1)","v":5},{"$f":"IF(Z5=0,\"\",MAX($U$4:Y4)+1)","v":6},{"$f":"IF(AA5=0,\"\",MAX($U$4:Z4)+1)","v":7},{"$f":"IF(AB5=0,\"\",MAX($U$4:AA4)+1)","v":8},{"$f":"IF(AC5=0,\"\",MAX($U$4:AB4)+1)","v":9},{"$f":"IF(AD5=0,\"\",MAX($U$4:AC4)+1)","v":10},{"$f":"IF(AE5=0,\"\",MAX($U$4:AD4)+1)","v":11},{"$f":"IF(AF5=0,\"\",MAX($U$4:AE4)+1)","v":""},{"$f":"IF(AG5=0,\"\",MAX($U$4:AF4)+1)","v":""},{"$f":"IF(AH5=0,\"\",MAX($U$4:AG4)+1)","v":""},{"$f":"IF(AI5=0,\"\",MAX($U$4:AH4)+1)","v":""},{"$f":"IF(AJ5=0,\"\",MAX($U$4:AI4)+1)","v":""},{"$f":"IF(AK5=0,\"\",MAX($U$4:AJ4)+1)","v":""},{"$f":"IF(AL5=0,\"\",MAX($U$4:AK4)+1)","v":""},{"$f":"IF(AM5=0,\"\",MAX($U$4:AL4)+1)","v":""},{"$f":"IF(AN5=0,\"\",MAX($U$4:AM4)+1)","v":""},{"$f":"IF(AO5=0,\"\",MAX($U$4:AN4)+1)","v":""},{"$f":"IF(AP5=0,\"\",MAX($U$4:AO4)+1)","v":""},{"$f":"IF(AQ5=0,\"\",MAX($U$4:AP4)+1)","v":""}]
[null,"Os dados podem ser alfanuméricos",null,null,null,null,null,null,null,null,null,null,null,null,null,null,null,null,null,null,{"$f":"INDIRECT(ADDRESS(8+U7-1,7))","v":"01 Imobilizado"},"01 Investimentos","02 Serviços","02 Vendas","03 Administrativas","03 Comunicações","03 Custos","03 Desenvolvimento  Organizacional (DO)","03 Impostos","03 Infraestrutura","03 Treinamentos",0,0,0,0,0,0,0,0,0,0,0,0,0,0,0,0,0,0,0]
[null,null,null,null,null,null,null,null,null,null,null,null,null,null,null,null,null,null,null,null,{"$f":"COUNTA(U8:U57)-COUNTBLANK(U8:U57)","v":1},{"$f":"COUNTA(V8:V57)-COUNTBLANK(V8:V57)","v":0},3,3,3,5,4,5,1,3,2,0,0,0,0,0,0,0,0,0,0,0,0,0,0,0,0,0,0,0]
[null,null,null,null,null,null,null,null,null,null,null,null,null,null,null,null,null,null,null,null,1,2,3,4,5,6,7,8,9,10,11,12,13,14,15,16,17,18,19,20,21,22,23,24,25,26,27,28,29,30]
[null,null,"Finanças",null,null,null,"01 Imobilizado",null,null,null,null,"01 Imobilizado",null,{"$f":"L8&O8","v":"01 Imobilizado1"},{"$f":"IF(P8=\"\",\"\",COUNTIF($L$8:L8,L8))","v":1},"Máquinas e Equipamentos",null,null,null,1,{"$f":"IF(ISERROR(VLOOKUP(U$5&$T8,$N$8:$P$1009,3,FALSE)),\"\",VLOOKUP(U$5&$T8,$N$8:$P$1009,3,FALSE))","v":"Máquinas e Equipamentos"},"","Consultoria","Produto \"A\"","Informática","Celular","Embalagem","Administrativos","ICMS s/ Vendas","Água e Esgoto",{"$f":"IF(ISERROR(VLOOKUP(AE$5&$T8,$N$8:$P$1009,3,FALSE)),\"\",VLOOKUP(AE$5&$T8,$N$8:$P$1009,3,FALSE))","v":"Informática"},"","","","","","","","","",{"$f":"IF(ISERROR(VLOOKUP(AO$5&$T8,$N$8:$P$1009,3,FALSE)),\"\",VLOOKUP(AO$5&$T8,$N$8:$P$1009,3,FALSE))","v":""},"","","","","","","","",""]
[null,null,"Presidência",null,null,null,"01 Investimentos",null,null,null,null,"02 Serviços",null,"02 Serviços1",{"$f":"IF(P9=\"\",\"\",COUNTIF($L$8:L9,L9))","v":1},"Consultoria",null,null,null,2,"","","Manutenção","Produto \"B\"","Matl. De Escritório","Internet","Energia Elétrica","Conultoria","","Energia Elétrica","Inglês in company","","","","","","","","","","","","","","","","","","",""]
[null,null,"Produção",null,null,null,"02 Serviços",null,null,null,null,"02 Serviços",null,"02 Serviços2",{"$f":"IF(P10=\"\",\"\",COUNTIF($L$8:L10,L10))","v":2},"Manutenção",null,null,null,3,{"$f":"IF(ISERROR(VLOOKUP(U$5&$T10,$N$8:$P$1009,3,FALSE)),\"\",VLOOKUP(U$5&$T10,$N$8:$P$1009,3,FALSE))","v":""},"","Operacionais","Produto \"C\"","Salários","Rádio - Nextel","Mão de Obra","Estudo de Cargos e Salários","","Manutenção Predial",{"$f":"IF(ISERROR(VLOOKUP(AE$5&$T10,$N$8:$P$1009,3,FALSE)),\"\",VLOOKUP(AE$5&$T10,$N$8:$P$1009,3,FALSE))","v":""},"","","","","","","","","",{"$f":"IF(ISERROR(VLOOKUP(AO$5&$T10,$N$8:$P$1009,3,FALSE)),\"\",VLOOKUP(AO$5&$T10,$N$8:$P$1009,3,FALSE))","v":""},"","","","","","","","",""]
[null,null,"Publicidade",null,null,null,"02 Vendas",null,null,null,null,"02 Serviços",null,"02 Serviços3",{"$f":"IF(P11=\"\",\"\",COUNTIF($L$8:L11,L11))","v":3},"Operacionais",null,null,null,4,"","","","","","Satélite","Matéria Prima","Operacionais","","","","","","","","","","","","","","","","","","","","","",""]
[null,null,"Receitas não Operacionais",null,null,null,"03 Administrativas",null,null,null,null,"02 Vendas",null,"02 Vendas1",{"$f":"IF(P12=\"\",\"\",COUNTIF($L$8:L12,L12))","v":1},"Produto \"A\"",null,null,null,5,"","","","","","Telefones","","Pesquisa de Clima","","","","","","","","","","","","","","","","","","","","","",""]
[null,null,"Receitas Operacionais",null,null,null,"03 Comunicações",null,null,null,null,"02 Vendas",null,"02 Vendas2",{"$f":"IF(P13=\"\",\"\",COUNTIF($L$8:L13,L13))","v":2},"Produto \"B\"",null,null,null,6,"","","","","","","","","","","","","","","","","","","","","","","","","","","","","",""]
[null,null,"Recursos Humanos",null,null,null,"03 Custos",null,null,null,null,"02 Vendas",null,"02 Vendas3",{"$f":"IF(P14=\"\",\"\",COUNTIF($L$8:L14,L14))","v":3},"Produto \"C\"",null,null,null,7,"","","","","","","","","","","","","","","","","","","","","","","","","","","","","",""]
[null,null,"Serviços Gerais (mass alocation)",null,null,null,"03 Desenvolvimento  Organizacional (DO)",null,null,null,null,"03 Administrativas",null,"03 Administrativas1",{"$f":"IF(P15=\"\",\"\",COUNTIF($L$8:L15,L15))","v":1},"Informática",null,null,null,8,"","","","","","","","","","","","","","","","","","","","","","","","","","","","","",""]
[null,null,null,null,null,null,"03 Impostos",null,null,null,null,"03 Administrativas",null,"03 Administrativas2",{"$f":"IF(P16=\"\",\"\",COUNTIF($L$8:L16,L16))","v":2},"Matl. De Escritório",null,null,null,9,"","","","","","","","","","","","","","","","","","","","","","","","","","","","","",""]
[null,null,null,null,null,null,"03 Infraestrutura",null,null,null,null,"03 Administrativas",null,"03 Administrativas3",{"$f":"IF(P17=\"\",\"\",COUNTIF($L$8:L17,L17))","v":3},"Salários",null,null,null,10,"","","","","","","","","","","","","","","","","","","","","","","","","","","","","",""]
[null,null,null,null,null,null,"03 Treinamentos",null,null,null,null,"03 Comunicações",null,"03 Comunicações1",{"$f":"IF(P18=\"\",\"\",COUNTIF($L$8:L18,L18))","v":1},"Celular",null,null,null,11,{"$f":"IF(ISERROR(VLOOKUP(U$5&$T18,$N$8:$P$1009,3,FALSE)),\"\",VLOOKUP(U$5&$T18,$N$8:$P$1009,3,FALSE))","v":""},"","","","","","","","","",{"$f":"IF(ISERROR(VLOOKUP(AE$5&$T18,$N$8:$P$1009,3,FALSE)),\"\",VLOOKUP(AE$5&$T18,$N$8:$P$1009,3,FALSE))","v":""},"","","","","","","","","",{"$f":"IF(ISERROR(VLOOKUP(AO$5&$T18,$N$8:$P$1009,3,FALSE)),\"\",VLOOKUP(AO$5&$T18,$N$8:$P$1009,3,FALSE))","v":""},"","","","","","","","",""]
[null,null,null,null,null,null,null,null,null,null,null,"03 Comunicações",null,"03 Comunicações2",{"$f":"IF(P19=\"\",\"\",COUNTIF($L$8:L19,L19))","v":2},"Internet",null,null,null,12,"","","","","","","","","","","","","","","","","","","","","","","","","","","","","",""]
[null,null,null,null,null,null,null,null,null,null,null,"03 Comunicações",null,"03 Comunicações3",{"$f":"IF(P20=\"\",\"\",COUNTIF($L$8:L20,L20))","v":3},"Rádio - Nextel",null,null,null,13,"","","","","","","","","","","","","","","","","","","","","","","","","","","","","",""]
{"$rows_left_out":989}